LogoopenSUSE Build Service > Projects
Sign Up | Log In

mlin7442's Home Project

No description set

Comments for home:mlin7442 (11)

Max Lin mlin7442 wrote over 2 years ago

test comment @mlin7442

Max Lin mlin7442 wrote over 2 years ago

test 1 CC [at]mlin7442

Max Lin mlin7442 wrote over 2 years ago

test2

@mlin7442

Max Lin mlin7442 wrote over 2 years ago

test3

CC [at]mlin7442

Max Lin mlin7442 wrote over 2 years ago

[ 163s] libtool: compile: g++ -DHAVE_CONFIG_H -I. -I.. -I/usr/include/libxml2 -DCONFDIR=\"/etc/sysconfig\" -D_FILE_OFFSET_BITS=64 -fmessage-length=0 -grecord-gcc-switches -O2 -Wall -D_FORTIFY_SOURCE=2 -fstack-protector -funwind-tables -fasynchronous-unwind-tables -g -DNDEBUG -std=c++0x -Wall -Wextra -Wformat=2 -Wnon-virtual-dtor -Wno-unused-parameter -MT Lvm.lo -MD -MP -MF .deps/Lvm.Tpo -c Lvm.cc -fPIC -DPIC -o .libs/Lvm.o [ 163s] libtool: compile: g++ -DHAVE_CONFIG_H -I. -I.. -I/usr/include/libxml2 -DCONFDIR=\"/etc/sysconfig\" -D_FILE_OFFSET_BITS=64 -fmessage-length=0 -grecord-gcc-switches -O2 -Wall -D_FORTIFY_SOURCE=2 -fstack-protector -funwind-tables -fasynchronous-unwind-tables -g -DNDEBUG -std=c++0x -Wall -Wextra -Wformat=2 -Wnon-virtual-dtor -Wno-unused-parameter -MT LvmCache.lo -MD -MP -MF .deps/LvmCache.Tpo -c LvmCache.cc -fPIC -DPIC -o .libs/LvmCache.o [ 164s] mv -f .deps/Acls.Tpo .deps/Acls.Plo [ 168s] Btrfs.cc: In member function 'bool snapper::StreamProcessor::dumper(int)': [ 168s] Btrfs.cc:1145:73: error: too few arguments to function 'int btrfs_read_and_process_send_stream(int, btrfs_send_ops*, void*, int, u64)' [ 168s] int r = btrfs_read_and_process_send_stream(fd, &send_ops, &this, 0); [ 168s] ^ [ 168s] In file included from Btrfs.cc:39:0: [ 168s] /usr/include/btrfs/send-stream.h:59:5: note: declared here [ 168s] int btrfs_read_and_process_send_stream(int fd, [ 168s] ^ [ 170s] Makefile:536: recipe for target 'Btrfs.lo' failed [ 170s] make[2]: ** [Btrfs.lo] Error 1 [ 170s] make[2]: *** Waiting for unfinished jobs.... [ 177s] mv -f .deps/Lvm.Tpo .deps/Lvm.Plo [ 181s] mv -f .deps/LvmCache.Tpo .deps/LvmCache.Plo [ 181s] make[2]: Leaving directory '/home/abuild/rpmbuild/BUILD/snapper-0.2.3/snapper' [ 181s] Makefile:470: recipe for target 'all-recursive' failed [ 181s] make[1]: *** [all-recursive] Error 1 [ 181s] make[1]: Leaving directory '/home/abuild/rpmbuild/BUILD/snapper-0.2.3' [ 181s] Makefile:378: recipe for target 'all' failed [ 181s] make: *** [all] Error 2

Max Lin mlin7442 wrote about 2 years ago

yes, it's true that xf86-video-ati build error is fixed in 7.5.0. but there still have several xf86-* packages build failed, eg. xf86-video-vmware and xf86-input-vmmouse

Max Lin mlin7442 wrote over 1 year ago

tyuiro

Max Lin mlin7442 wrote over 1 year ago

@dimstar just a remind, in case if you've rebased a staging project and that project had within any packages(except Test-DVD-XXX), then you have to enable the repos build, ie. freeze J, J's all repos were disabled, must enable them :)

and yes, I'm play my home project like a forum :P

Max Lin mlin7442 wrote over 1 year ago

test 0817

Max Lin mlin7442 wrote 9 months ago

hello 2016

Max Lin mlin7442 wrote 9 months ago

test Taiepi Labs sSHaring Day