File not found: content_browser_client-incomplete-WebUIController.patch

Build cross platform desktop apps with JavaScript, HTML, and CSS

Edit Package nodejs-electron
https://github.com/electron/electron

Nodejs application: Build cross platform desktop apps with JavaScript, HTML, and CSS

Refresh
Refresh
Source Files
Filename Size Changed
ANNOTATE_CONTIGUOUS_CONTAINER-Wodr.patch 0000011362 11.1 KB
Cr122-ffmpeg-new-channel-layout.patch 0000017840 17.4 KB
Electron.desktop 0000000164 164 Bytes
RenderFrameHostImpl-use-after-free.patch 0000001952 1.91 KB
_constraints 0000000619 619 Bytes
aarch64-Xclang.patch 0000000529 529 Bytes
absl2023-encapsulated_web_transport-StrCat.patch 0000000709 709 Bytes
absl_strings-missing-headers.patch 0000001188 1.16 KB
angle-BlobCache-Success.patch 0000000438 438 Bytes
angle-SPV_BINARY_TO_TEXT_OPTION_NESTED_INDENT.patch 0000003237 3.16 KB
angle-system-xxhash.patch 0000001267 1.24 KB
aom-vpx-no-thread-wrapper.patch 0000002238 2.19 KB
audio_file_reader-ffmpeg-AVFrame-duration.patch 0000002716 2.65 KB
ax_platform_node_id-fpermissive.patch 0000000486 486 Bytes
base-system-nspr.patch 0000001323 1.29 KB
brotli-remove-shared-dictionary.patch 0000003054 2.98 KB
browser_process_impl-fix-safe_browsing_mode-0.patch 0000002089 2.04 KB
bsc1224178-font-gc.patch 0000064826 63.3 KB
build-without-extensions.patch 0000002915 2.85 KB
build-without-guest-view.patch 0000001245 1.22 KB
build-without-mesage-center.patch 0000000507 507 Bytes
cares_public_headers.patch 0000000395 395 Bytes
chromium-102-compiler.patch 0000010382 10.1 KB
chromium-118-sigtrap_system_ffmpeg.patch 0000000845 845 Bytes
chromium-123-qrcode.patch 0000002100 2.05 KB
chromium-125-cloud_authenticator.patch 0000000238 238 Bytes
chromium-127-cargo_crate.patch 0000000299 299 Bytes
chromium-127-crabby.patch 0000001645 1.61 KB
chromium-129-disable-H.264-video-parser-during-demuxing.patch 0000000779 779 Bytes
chromium-130-fontations.patch 0000007334 7.16 KB
chromium-132-no-rust.patch 0000011613 11.3 KB
chromium-91-java-only-allowed-in-android-builds.patch 0000000722 722 Bytes
chromium-93-ffmpeg-4.4.patch 0000002129 2.08 KB
chromium-94.0.4606.71-InkDropHost-crash.patch 0000001280 1.25 KB
chromium-remove-bundled-roboto-font.patch 0000001823 1.78 KB
common.gypi-compiler.patch 0000002865 2.8 KB
common.gypi-remove-fno-omit-frame-pointer.patch 0000000997 997 Bytes
compact_enc_det_generated_tables-Wnarrowing.patch 0000370390 362 KB
cr130-abseil-remove-unused-deps.patch 0000004569 4.46 KB
cr130-absl-base.patch 0000002470 2.41 KB
create_tarball.sh 0000020299 19.8 KB
devtools-frontend-compress_files-oom.patch 0000000625 625 Bytes
disable-FFmpegAllowLists.patch 0000000610 610 Bytes
disable-avif-really.patch 0000001879 1.83 KB
disable-catapult.patch 0000012362 12.1 KB
disable-fuses.patch 0000003748 3.66 KB
disable-tests.patch 0000000707 707 Bytes
disable-webspeech.patch 0000012038 11.8 KB
do-not-build-libvulkan.so.patch 0000001130 1.1 KB
electron-16-freetype-visibility-list.patch 0000000540 540 Bytes
electron-16-system-node-headers.patch 0000000632 632 Bytes
electron-16-third_party-symbolize-missing-include.patch 0000000481 481 Bytes
electron-37.4.0.tar.zst 1070535466 1020 MB
electron-launcher.sh 0000000614 614 Bytes
enable_stack_trace_line_numbers-symbol_level.patch 0000001047 1.02 KB
event_record-optional-initializer.patch 0000000596 596 Bytes
ffmpeg-4-AV_PROFILE.patch 0000008990 8.78 KB
ffmpeg-7-ffmpeg_video_decoder-reordered_opaque.patch 0000005595 5.46 KB
ffmpeg-new-channel-layout.patch 0000013671 13.4 KB
file_dialog-missing-uint32_t.patch 0000000372 372 Bytes
fix-build-without-screen-ai.patch 0000007891 7.71 KB
fix-build-without-supervised-users.patch 0000002576 2.52 KB
fix-system-highway.patch 0000000321 321 Bytes
fpic.patch 0000003743 3.66 KB
gcc-asmflags.patch 0000000393 393 Bytes
gcc-enable-lto.patch 0000001472 1.44 KB
gn-logspam-breaks-install.patch 0000001153 1.13 KB
icon.patch 0000000591 591 Bytes
identity_request_account-incomplete-IdentityProviderData.patch 0000009648 9.42 KB
json_to_struct-fixed_flat_map-conflicting-declaration.patch 0000001029 1 KB
libxml-2.12-xmlCtxtGetLastError-const.patch 0000001335 1.3 KB
llhttp-lax-vector-conversions.patch 0000005449 5.32 KB
lock_impl_posix-pthread_mutexattr_setprotocol-conflicting.patch 0000000616 616 Bytes
masked_domain_list-flatbuffers.patch 0000001066 1.04 KB
more-locales.patch 0000003806 3.72 KB
mt21_util-flax-vector-conversions.patch 0000001154 1.13 KB
nasm-generate-debuginfo.patch 0000000300 300 Bytes
no-zlib-headers.patch 0000000409 409 Bytes
node-cares-1.21-2.patch 0000010157 9.92 KB
node-cares-1.21-3.patch 0000001115 1.09 KB
node-cares-1.21-4.patch 0000001359 1.33 KB
node-cares-1.21.patch 0000005397 5.27 KB
node-kParentNodeTag-constexpr-initializer.patch 0000000550 550 Bytes
node-nghttp-1.50.patch 0000003446 3.37 KB
node-system-icu.patch 0000000486 486 Bytes
node-version-ck.patch 0000000866 866 Bytes
nodejs-electron.changes 0000125004 122 KB
nodejs-electron.spec 0000054306 53 KB
offscreen_canvas-incomplete-LayoutLocale.patch 0000000582 582 Bytes
partition_alloc-strict-aliasing.patch 0000005063 4.94 KB
pdfium-fix-system-libs.patch 0000000890 890 Bytes
permission-gcc14.2.patch 0000000499 499 Bytes
pickle_traits-kIndexSequence-constexpr-initializer.patch 0000000364 364 Bytes
picture_in_picture_events_info-string-constexpr.patch 0000000880 880 Bytes
private_aggregation_host-uint128.patch 0000005214 5.09 KB
rdynamic.patch 0000000332 332 Bytes
reduce-gn-tree.patch 0000001638 1.6 KB
remove-ai-language-detection-factory-which-requires-tflite-and-libphonenumber.patch 0000028594 27.9 KB
remove-date-reproducible-builds.patch 0000002708 2.64 KB
remove-dawn.patch 0000003706 3.62 KB
remove-password-manager-and-policy.patch 0000011964 11.7 KB
remove-probabilistic-token-which-uses-private-join-and-compute.patch 0000001666 1.63 KB
remove-puffin.patch 0000000777 777 Bytes
remove-rust.patch 0000005373 5.25 KB
remove-sync.patch 0000010761 10.5 KB
sandboxed_vfs_file_impl-missing-memset.patch 0000000303 303 Bytes
seccomp_bpf-no-lto.patch 0000001137 1.11 KB
string_view-incomplete-CodePointIterator.patch 0000004663 4.55 KB
support-i386.patch 0000000833 833 Bytes
swiftshader-LLVMJIT-AddressSanitizerPass-dead-code-remove.patch 0000002219 2.17 KB
swiftshader-llvm18-LLVMJIT-CodeGenOptLevel.patch 0000002000 1.95 KB
swiftshader-llvm18-LLVMJIT-Host.patch 0000000613 613 Bytes
swiftshader-llvm18-LLVMReactor-getInt8PtrTy.patch 0000001533 1.5 KB
swiftshader-llvm19-LLVMJIT-getHostCPUFeatures.patch 0000000760 760 Bytes
swiftshader-llvm19-LLVMReactor-incomplete-Module.patch 0000000426 426 Bytes
swiftshader-llvm20-absoluteSymbols.patch 0000000516 516 Bytes
swiftshader-use-system-llvm.patch 0000001213 1.18 KB
system-absl_algorithm.patch 0000000809 809 Bytes
system-dragonbox.patch 0000000537 537 Bytes
system-gtest.patch 0000001945 1.9 KB
system-libbsd.patch 0000000689 689 Bytes
system-libdrm.patch 0000001858 1.81 KB
system-libm.patch 0000002087 2.04 KB
system-nasm.patch 0000000377 377 Bytes
system-pydeps.patch 0000008780 8.57 KB
system-six.patch 0000000922 922 Bytes
system-sqlite.patch 0000001870 1.83 KB
system-usb_ids.patch 0000000775 775 Bytes
system-wayland.patch 0000000486 486 Bytes
system-zstd-in-node.patch 0000000379 379 Bytes
torque-debuginfo.patch 0000002510 2.45 KB
use-system-libraries-in-node.patch 0000004803 4.69 KB
v8-assume-x86-64-v2-support.patch 0000002169 2.12 KB
v8-highway-1.1.patch 0000006257 6.11 KB
v8-simd-flax-vector-conversions.patch 0000002994 2.92 KB
v8-strict-aliasing.patch 0000004112 4.02 KB
vaapi-no-encoders.patch 0000004936 4.82 KB
wayland_version.patch 0000000438 438 Bytes
webgl_rendering_context_webgpu_base-incomplete-StaticBitmapImage.patch 0000000821 821 Bytes
webp-no-sharpyuv.patch 0000000645 645 Bytes
webrtc-138-Wchanges-meaning.patch 0000001678 1.64 KB
webrtc-make_ref_counted-absl2024-nullability.patch 0000001272 1.24 KB
xr_webgl_swap_chain-incomplete-StaticBitmapImage.patch 0000000672 672 Bytes
zip_internal-missing-uLong-Z_DEFAULT_COMPRESSION.patch 0000000387 387 Bytes
Comments 16

O. Gas Valve's avatar

Apps like signal-desktop are failing on execution with: /usr/lib64/electron/electron: symbol lookup error: /usr/lib64/electron/electron: undefined symbol: hb_subset_input_set_retain_gids


Dominik Heidler's avatar

According to the discussion at https://aur.archlinux.org/packages/freetube/ which seems to be the same problem, this is due to the harfbuzz library removing some "legacy code" that includes that function: https://github.com/harfbuzz/harfbuzz/commit/d700646c33af53afcabe564e9943565d58e1192a

This also seems to break the build here atm.


O. Gas Valve's avatar

I did see that. It's not the first time I've seen harfbuzz break everything in a package bulk build. What about updating this to latest stable or adding a new package for v16 so we can get apps working again?


sergio Basto's avatar

builds for Fedora 39+ fails because of the new vulkan version on Fedora , you can found the full logs in https://copr.fedorainfracloud.org/coprs/sergiomb/electrons/package/nodejs-electron/

Any suggestion to fix the build ?

in file included from ../../third_party/vulkan_memory_allocator/vma.cpp:8:
../../third_party/vulkan_memory_allocator/include/vk_mem_alloc.h: In member function ‘virtual void VmaBlockMetadata_Generic::CalcAllocationStatInfo(VmaStatInfo&) const’:
../../third_party/vulkan_memory_allocator/include/vk_mem_alloc.h:7996:20: warning: unused variable ‘rangeCount’ [-Wunused-variable]
 7996 |     const uint32_t rangeCount = (uint32_t)m_Suballocations.size();
      |                    ^~~~~~~~~~
../../third_party/vulkan_memory_allocator/include/vk_mem_alloc.h: In member function ‘virtual void VmaBlockMetadata_Linear::Alloc(const VmaAllocationRequest&, VmaSuballocationType, void*)’:

Bruno Pitrus's avatar

I don't see any builds failing here, and what you pasted is not a build error.


sergio Basto's avatar

yeah, sorry, anyway full logs are here in builder-live.log.gz https://download.copr.fedorainfracloud.org/results/sergiomb/electrons/fedora-39-x86_64/06969127-nodejs-electron/builder-live.log.gz

[7213/40867] "python3" "../../build/toolchain/gcc_solink_wrapper.py" --readelf="readelf" --nm="gcc-nm"  --sofile="./libvk_swiftshader.so" --tocfile="./libvk_swiftshader.so.TOC" --output="./libvk_swiftshader.so" -- g++ -shared -Wl,-soname="libvk_swiftshader.so" -Wl,-Bsymbolic -Wl,--version-script=../../third_party/swiftshader/src/Vulkan/vk_swiftshader.lds -Wl,--build-id=sha1 -Wl,-z,noexecstack -Wl,-z,relro -Wl,-z,now -Wl,-z,defs -Wl,--as-needed -Wl,-z,relro -Wl,--as-needed  -Wl,-z,now -specs=/usr/lib/rpm/redhat/redhat-hardened-ld -specs=/usr/lib/rpm/redhat/redhat-annobin-cc1  -Wl,--build-id=sha1   -Wl,-O2 -Wl,--gc-sections  -Wl,--as-needed -fuse-ld=lld -o "./libvk_swiftshader.so" @"./libvk_swiftshader.so.rsp"  
FAILED: libvk_swiftshader.so libvk_swiftshader.so.TOC 
"python3" "../../build/toolchain/gcc_solink_wrapper.py" --readelf="readelf" --nm="gcc-nm"  --sofile="./libvk_swiftshader.so" --tocfile="./libvk_swiftshader.so.TOC" --output="./libvk_swiftshader.so" -- g++ -shared -Wl,-soname="libvk_swiftshader.so" -Wl,-Bsymbolic -Wl,--version-script=../../third_party/swiftshader/src/Vulkan/vk_swiftshader.lds -Wl,--build-id=sha1 -Wl,-z,noexecstack -Wl,-z,relro -Wl,-z,now -Wl,-z,defs -Wl,--as-needed -Wl,-z,relro -Wl,--as-needed  -Wl,-z,now -specs=/usr/lib/rpm/redhat/redhat-hardened-ld -specs=/usr/lib/rpm/redhat/redhat-annobin-cc1  -Wl,--build-id=sha1   -Wl,-O2 -Wl,--gc-sections  -Wl,--as-needed -fuse-ld=lld -o "./libvk_swiftshader.so" @"./libvk_swiftshader.so.rsp"  
ld.lld: error: version script assignment of 'global' to symbol 'vkCreateXlibSurfaceKHR' failed: symbol not defined
ld.lld: error: version script assignment of 'global' to symbol 'vkGetPhysicalDeviceXlibPresentationSupportKHR' failed: symbol not defined
ld.lld: error: version script assignment of 'global' to symbol 'vkCreateDirectFBSurfaceEXT' failed: symbol not defined
ld.lld: error: version script assignment of 'global' to symbol 'vkGetPhysicalDeviceDirectFBPresentationSupportEXT' failed: symbol not defined
collect2: error: ld returned 1 exit status

sergio Basto's avatar

ah ldd is disable and I had it enabled , I'm firing a new build


sergio Basto's avatar

Following https://bugs.chromium.org/p/chromium/issues/detail?id=1374347 export LDFLAGS="${LDFLAGS} -Wl,--as-needed -fuse-ld=lld -Wl,--undefined-version" fixes the build for F39
on Rawhide we need to add: BuildRequires: python3-setuptools
But now I got an error with zlib , we need bundle zlib according https://bugzilla.redhat.com/show_bug.cgi?id=2242271


Bruno Pitrus's avatar

You should not use lld, it does not work with GCC. Also zlib should never be bundled as it is part of electron's exported API.

May i know what are you trying to do? Electron builds fine on Fedora 39 here on OBS, on both x86_64 and aarch64: https://build.opensuse.org/package/live_build_log/devel:languages:nodejs/nodejs-electron/Fedora_39/x86_64


sergio Basto's avatar

I'm building electron for Fedora in copr instead OBS for my personal use, maybe one day I will add it to Fedora . About lId, I was confused, I though lld replaces gold and gold linker was deprecated on Fedora (but neither one and other are true), I will check that. anyway build with lld makes bins 10% smaller . thank you


Bruno Pitrus's avatar

lld does not support LTO (which actually makes the binaries several dozen MB smaller when enabled). The builds here are done with the default GNU bfd linker and with LTO enabled (exactly according to packaging policy)

As for adding Electron to Fedora proper, that's tremendously unlikely due to upstream's extremely short API/ABI stability guarantees. (I have removed it from Leap for that very reason)


sergio Basto's avatar

ah ok , now I also built electron with LTO . thank you
On Rawhide we need to add: BuildRequires: python3-setuptools to avoid distutils error.
With https://fedoraproject.org/wiki/Changes/MinizipNGTransition got an error with zlib , we need bundle zlib according https://bugzilla.redhat.com/show_bug.cgi?id=2242271


Bruno Pitrus's avatar

minizip and z are two different libraries even if they are built from the same “zlib” source tree. I repeat you do not want to bundle z as it is exported by electron, meaning it would interpose the system copy which is loaded by basically everything.

You may try bundling minizip (only) but you would need to do it manually — it has been stripped from this tarball.

Personally, i would try to patch the offending file not to use this API — this is something that will need to get done eventually anyway.



Bruno Pitrus's avatar

But zlib is not a problem. All the errors are from minizip.


sergio Basto's avatar

Sorry , when I wrote bundle zlib , was want wrote bundle minizip quoting from https://bugzilla.redhat.com/show_bug.cgi?id=2242271 "Also, I can see chromium bundles minizip as well. Is our Fedora chromium package ready to switch to bundled minizip "

openSUSE Build Service is sponsored by